Reaction Details
TargetVoltage-dependent L-type calcium channel subunit alpha-1C
LigandBDBM50042751
Substrate/Competitorn/a
Meas. Tech.ChEBML_92774
Ki 64±n/a nM
Citation Baindur, NRutledge, ATriggle, DJ A homologous series of permanently charged 1,4-dihydropyridines: novel probes designed to localize drug binding sites on ion channels. J Med Chem36:3743-5 (1994) Voltage-dependent L-type calcium channel subunit alpha-1C
Name:Voltage-dependent L-type calcium channel subunit alpha-1C
Type:Enzyme Catalytic Domain
Mol. Mass.:243492.26
Organism:RAT
Description:Calcium channel 0 RAT::P22002
Residue:2169
BDBM50042751
NameBDBM50042751
Synonyms:CHEMBL125814 | {16-[5-Methoxycarbonyl-2,6-dimethyl-4-(2-trifluoromethyl-phenyl)-1,4-dihydro-pyridine-3-carbonyloxy]-hexadecyl}-trimethyl-ammonium
TypeSmall organic molecule
Emp. Form.C36H56F3N2O4
Mol. Mass.637.8355
SMILESCOC(=O)C1C(C(C(=O)OCCCCCCCCCCCCCCCC[N+](C)(C)C)=C(C)N=C1C)c1ccccc1C(F)(F)F