Reaction Details
TargetVoltage-dependent L-type calcium channel subunit alpha-1C
LigandBDBM50042752
Substrate/Competitorn/a
Meas. Tech.ChEBML_92774
Ki 17±n/a nM
Citation Baindur, NRutledge, ATriggle, DJ A homologous series of permanently charged 1,4-dihydropyridines: novel probes designed to localize drug binding sites on ion channels. J Med Chem36:3743-5 (1994) Voltage-dependent L-type calcium channel subunit alpha-1C
Name:Voltage-dependent L-type calcium channel subunit alpha-1C
Type:Enzyme Catalytic Domain
Mol. Mass.:243492.26
Organism:RAT
Description:Calcium channel 0 RAT::P22002
Residue:2169
BDBM50042752
NameBDBM50042752
Synonyms:CHEMBL122740 | {12-[5-Methoxycarbonyl-2,6-dimethyl-4-(2-trifluoromethyl-phenyl)-1,4-dihydro-pyridine-3-carbonyloxy]-dodecyl}-trimethyl-ammonium
TypeSmall organic molecule
Emp. Form.C32H48F3N2O4
Mol. Mass.581.7292
SMILESCOC(=O)C1C(C(C(=O)OCCCCCCCCCCCC[N+](C)(C)C)=C(C)N=C1C)c1ccccc1C(F)(F)F