Reaction Details
TargetPurine nucleoside phosphorylase
LigandBDBM50042803
Substrate/Competitorn/a
Meas. Tech.ChEMBL_162036 (CHEMBL766676)
IC50 23±n/a nM
Citation Erion, MDNiwas, SRose, JDAnanthan, SAllen, MSecrist, JABabu, YSBugg, CEGuida, WCEalick, SE Structure-based design of inhibitors of purine nucleoside phosphorylase. 3. 9-Arylmethyl derivatives of 9-deazaguanine substituted on the methylene group. J Med Chem36:3771-83 (1994) Purine nucleoside phosphorylase
Name:Purine nucleoside phosphorylase
Type:Enzyme
Mol. Mass.:32119.53
Organism:Homo sapiens (Human)
Description:n/a
Residue:289
BDBM50042803
NameBDBM50042803
Synonyms:3-(2-Amino-4-oxo-4,5-dihydro-3H-pyrrolo[3,2-d]pyrimidin-7-yl)-3-phenyl-propionitrile | CHEMBL124429
TypeSmall organic molecule
Emp. Form.C15H13N5O
Mol. Mass.279.2966
SMILESNc1nc2c(c[nH]c2c(=O)[nH]1)C(CC#N)c1ccccc1