Reaction Details
TargetNeprilysin
LigandBDBM50042828
Substrate/Competitorn/a
Meas. Tech.ChEBML_144597
IC50 0.800000±n/a nM
Citation MacPherson, LJBayburt, EKCapparelli, MPBohacek, RSClarke, FHGhai, RDSakane, YBerry, CJPeppard, JVTrapani, AJ Design and synthesis of an orally active macrocyclic neutral endopeptidase 24.11 inhibitor. J Med Chem36:3821-8 (1994) Neprilysin
Name:Neprilysin
Type:Protein
Mol. Mass.:85789.59
Organism:Rattus norvegicus (Rat)
Description:P07861
Residue:750
BDBM50042828
NameBDBM50042828
Synonyms:4-Hydroxy-1-(9-mercaptomethyl-10-oxo-azecane-2-carbonyl)-pyrrolidine-2-carboxylic acid | CHEMBL124536
TypeSmall organic molecule
Emp. Form.C16H26N2O5S
Mol. Mass.358.453
SMILESO[C@@H]1C[C@H](N(C1)C(=O)C1CCCCCCC(CS)C(=O)N1)C(O)=O