Reaction Details
TargetNeprilysin
LigandBDBM50042832
Substrate/Competitorn/a
Meas. Tech.ChEBML_144597
IC50 11±n/a nM
Citation MacPherson, LJBayburt, EKCapparelli, MPBohacek, RSClarke, FHGhai, RDSakane, YBerry, CJPeppard, JVTrapani, AJ Design and synthesis of an orally active macrocyclic neutral endopeptidase 24.11 inhibitor. J Med Chem36:3821-8 (1994) Neprilysin
Name:Neprilysin
Type:Protein
Mol. Mass.:85789.59
Organism:Rattus norvegicus (Rat)
Description:P07861
Residue:750
BDBM50042832
NameBDBM50042832
Synonyms:3-Hydroxy-2-[(9-mercaptomethyl-10-oxo-azecane-2-carbonyl)-amino]-propionic acid | CHEMBL125040
TypeSmall organic molecule
Emp. Form.C14H24N2O5S
Mol. Mass.332.416
SMILESOC[C@@H](NC(=O)C1CCCCCCC(CS)C(=O)N1)C(O)=O