Reaction Details
TargetRibonucleoside-diphosphate reductase large subunit
LigandBDBM50368749
Substrate/Competitorn/a
Meas. Tech.ChEMBL_195410 (CHEMBL803340)
IC50 25000±n/a nM
Citation Fisher, AYang, FDRubin, HCooperman, BS R2 C-terminal peptide inhibition of mammalian and yeast ribonucleotide reductase. J Med Chem36:3859-62 (1994) Ribonucleoside-diphosphate reductase large subunit
Name:Ribonucleoside-diphosphate reductase large subunit
Type:PROTEIN
Mol. Mass.:90210.73
Organism:Mus musculus
Description:ChEMBL_195411
Residue:792
BDBM50368749
NameBDBM50368749
Synonyms:CHEMBL1790913
TypeSmall organic molecule
Emp. Form.C41H55N7O14
Mol. Mass.869.9139
SMILESCC(C)C[C@H](NC(=O)[C@@H](NC(=O)[C@H](Cc1ccccc1)NC(C)=O)[C@H](C)O)C(=O)N[C@@H](CC(O)=O)C(=O)N[C@@H](C)C(=O)N[C@@H](CC(O)=O)C(=O)N[C@@H](Cc1ccccc1)C(O)=O