Reaction Details
TargetRibonucleoside-diphosphate reductase large subunit
LigandBDBM50368745
Substrate/Competitorn/a
Meas. Tech.ChEMBL_195411 (CHEMBL803341)
IC50 100000±n/a nM
Citation Fisher, AYang, FDRubin, HCooperman, BS R2 C-terminal peptide inhibition of mammalian and yeast ribonucleotide reductase. J Med Chem36:3859-62 (1994) Ribonucleoside-diphosphate reductase large subunit
Name:Ribonucleoside-diphosphate reductase large subunit
Type:PROTEIN
Mol. Mass.:90210.73
Organism:Mus musculus
Description:ChEMBL_195411
Residue:792
BDBM50368745
NameBDBM50368745
Synonyms:CHEMBL2369633
TypeSmall organic molecule
Emp. Form.C46H56N8O15
Mol. Mass.960.9814
SMILESC[C@@H](O)[C@H](NC(=O)[C@H](Cc1ccccc1)NC(C)=O)C(=O)N[C@@H](Cc1ccccc1)C(=O)N[C@@H](CC(N)=O)C(=O)N[C@@H](CCC(O)=O)C(=O)N[C@@H](CC(O)=O)C(=O)N[C@@H](Cc1ccccc1)C(O)=O