Reaction Details
TargetRibonucleoside-diphosphate reductase large subunit
LigandBDBM50368770
Substrate/Competitorn/a
Meas. Tech.ChEMBL_195416 (CHEMBL803346)
IC50 29000±n/a nM
Citation Fisher, AYang, FDRubin, HCooperman, BS R2 C-terminal peptide inhibition of mammalian and yeast ribonucleotide reductase. J Med Chem36:3859-62 (1994) Ribonucleoside-diphosphate reductase large subunit
Name:Ribonucleoside-diphosphate reductase large subunit
Type:PROTEIN
Mol. Mass.:90210.73
Organism:Mus musculus
Description:ChEMBL_195411
Residue:792
BDBM50368770
NameBDBM50368770
Synonyms:CHEMBL1790906
TypeSmall organic molecule
Emp. Form.C43H61N7O12
Mol. Mass.867.9841
SMILESCC(C)C[C@H](NC(=O)[C@H](C)NC(=O)[C@H](CC(O)=O)NC(=O)[C@H](CC(C)C)NC(=O)[C@@H](NC(=O)[C@H](Cc1ccccc1)NC(C)=O)[C@H](C)O)C(=O)N[C@@H](Cc1ccccc1)C(O)=O