Reaction Details
TargetBeta-2 adrenergic receptor
LigandBDBM50042998
Substrate/Competitorn/a
Meas. Tech.ChEBML_30208
Ki 5500±n/a nM
Citation Chen, GTKing, MGusovsky, FCreveling, CRDaly, JWChen, BHNie, JYKirk, KL Syntheses of 2,5- and 2,6-difluoronorepinephrine, 2,5-difluoroepinephrine, and 2,6-difluorophenylephrine: effect of disubstitution with fluorine on adrenergic activity. J Med Chem36:3947-55 (1994) Beta-2 adrenergic receptor
Name:Beta-2 adrenergic receptor
Type:PROTEIN
Mol. Mass.:46896.26
Organism:Rattus norvegicus
Description:ChEMBL_38603
Residue:418
BDBM50042998
NameBDBM50042998
Synonyms:5-(2-Amino-1-hydroxy-ethyl)-3-fluoro-benzene-1,2-diol(5-FNE) | CHEMBL129190
TypeSmall organic molecule
Emp. Form.C8H10FNO3
Mol. Mass.187.1683
SMILESNCC(O)c1cc(O)c(O)c(F)c1