Reaction Details
TargetBeta-1/Beta-2/Beta-3 adrenergic receptor
LigandBDBM50042997
Substrate/Competitorn/a
Meas. Tech.ChEMBL_41763 (CHEMBL650213)
EC50>100000±n/a nM
Citation Chen, GTKing, MGusovsky, FCreveling, CRDaly, JWChen, BHNie, JYKirk, KL Syntheses of 2,5- and 2,6-difluoronorepinephrine, 2,5-difluoroepinephrine, and 2,6-difluorophenylephrine: effect of disubstitution with fluorine on adrenergic activity. J Med Chem36:3947-55 (1994) Beta-1/Beta-2/Beta-3 adrenergic receptor
Name:Beta-1/Beta-2/Beta-3 adrenergic receptor
Synonyms:Adrenergic receptor beta
Type:n/a
Mol. Mass.:n/a
Description:ASSAY_ID of ChEMBL is 1340543
Components:This complex has 3 components.
Component 1
Name:Beta-1 adrenergic receptor
Type:Protein
Mol. Mass.:50486.84
Organism:Rattus norvegicus (Rat)
Description:P18090
Residue:466
Component 2
Name:Beta-2 adrenergic receptor
Synonyms:ADRB2_RAT Adrb2r | Adrenergic receptor beta
Type:PROTEIN
Mol. Mass.:46896.26
Organism:Rattus norvegicus
Description:ChEMBL_38603
Residue:418
Component 3
Name:Beta-3 adrenergic receptor
Synonyms:ADRB3_RAT Adrb3r Beta-3 adrenergic receptor
Type:PROTEIN
Mol. Mass.:43161.83
Organism:Rattus norvegicus
Description:ChEMBL_1509452
Residue:400
BDBM50042997
NameBDBM50042997
Synonyms:4-(2-Amino-1-hydroxy-ethyl)-3,5-difluoro-benzene-1,2-diol(2,6-DiFNE) | CHEMBL435802
TypeSmall organic molecule
Emp. Form.C8H9F2NO3
Mol. Mass.205.1588
SMILESNCC(O)c1c(F)cc(O)c(O)c1F