Reaction Details
TargetBeta-1 adrenergic receptor
LigandBDBM50019060
Substrate/Competitorn/a
Meas. Tech.ChEBML_30207
Ki 2500±n/a nM
Citation Chen, GTKing, MGusovsky, FCreveling, CRDaly, JWChen, BHNie, JYKirk, KL Syntheses of 2,5- and 2,6-difluoronorepinephrine, 2,5-difluoroepinephrine, and 2,6-difluorophenylephrine: effect of disubstitution with fluorine on adrenergic activity. J Med Chem36:3947-55 (1994) Beta-1 adrenergic receptor
Name:Beta-1 adrenergic receptor
Type:Protein
Mol. Mass.:50486.84
Organism:Rattus norvegicus (Rat)
Description:P18090
Residue:466
BDBM50019060
NameBDBM50019060
Synonyms:(+/-)4-(2-Amino-1-hydroxy-ethyl)-3-fluoro-benzene-1,2-diol 4-(2-Amino-1-hydroxy-ethyl)-3-fluoro-benzene-1,2-diol(2-FNE) | CHEMBL287587
TypeSmall organic molecule
Emp. Form.C8H10FNO3
Mol. Mass.187.1683
SMILESNCC(O)c1ccc(O)c(O)c1F