Reaction Details
TargetEndothelin-1 receptor
LigandBDBM50368772
Substrate/Competitorn/a
Meas. Tech.ChEMBL_65811 (CHEMBL872385)
IC50 0.70±n/a nM
Citation Kikuchi, TKubo, KOhtaki, TSuzuki, NAsami, TShimamoto, NWakimasu, MFujino, M Endothelin-1 analogues substituted at both position 18 and 19: highly potent endothelin antagonists with no selectivity for either receptor subtype ETA or ETB. J Med Chem36:4087-93 (1994) Endothelin-1 receptor
Name:Endothelin-1 receptor
Type:PROTEIN
Mol. Mass.:48707.29
Organism:Sus scrofa
Description:ChEMBL_65803
Residue:427
BDBM50368772
NameBDBM50368772
Synonyms:CHEMBL2373291
TypeSmall organic molecule
Emp. Form.C112H165N25O31S5
Mol. Mass.2517.982
SMILES[H][C@@]12CSSC[C@]([H])(NC(=O)[C@H](CCC(O)=O)NC(=O)[C@@H](CCCCN)NC(=O)[C@@H](CC(O)=O)NC(=O)[C@@H](CCSC)NC(=O)[C@H](CC(C)C)NC(=O)[C@@H](CO)NC(=O)[C@H](CO)NC1=O)C(=O)N[C@@H](C(C)C)C(=O)N[C@H](Cc1ccc(O)cc1)C(=O)N[C@@H](Cc1ccccc1)C(=O)N[C@@H](CSSC[C@@H](N)C(=O)N[C@@H](CO)C(=O)N2)C(=O)N[C@@H](Cc1c[nH]cn1)C(=O)N[C@@H](CC(C)C)C(=O)N[C@@H]([C@@H](C)O)C(=O)N[C@@H](CC1CCCCC1)C(=O)N[C@@H]([C@@H](C)CC)C(=O)N[C@@H](Cc1c[nH]c2ccccc12)C(O)=O