Reaction Details
TargetReverse transcriptase/RNaseH
LigandBDBM50029981
Substrate/Competitorn/a
Meas. Tech.ChEMBL_195526 (CHEMBL800593)
IC50 30000±n/a nM
Citation Patil, ADFreyer, AJEggleston, DSHaltiwanger, RCBean, MFTaylor, PBCaranfa, MJBreen, ALBartus, HRJohnson, RK The inophyllums, novel inhibitors of HIV-1 reverse transcriptase isolated from the Malaysian tree, Calophyllum inophyllum Linn. J Med Chem36:4131-8 (1994) Reverse transcriptase/RNaseH
Name:Reverse transcriptase/RNaseH
Type:PROTEIN
Mol. Mass.:65229.15
Organism:Human immunodeficiency virus 1
Description:ChEMBL_1473730
Residue:566
BDBM50029981
NameBDBM50029981
Synonyms:12-Hydroxy-6,6,10,11-tetramethyl-4-phenyl-11,12-dihydro-6H,10H-dipyrano[2,3-f;2',3'-h]chromen-2-one | CHEMBL132692
TypeSmall organic molecule
Emp. Form.C25H24O5
Mol. Mass.404.4551
SMILESC[C@H]1Oc2c3C=CC(C)(C)Oc3c3c(cc(=O)oc3c2[C@@H](O)[C@H]1C)-c1ccccc1