Reaction Details
TargetReverse transcriptase/RNaseH
LigandBDBM50029993
Substrate/Competitorn/a
Meas. Tech.ChEMBL_195526 (CHEMBL800593)
IC50>100000±n/a nM
Citation Patil, ADFreyer, AJEggleston, DSHaltiwanger, RCBean, MFTaylor, PBCaranfa, MJBreen, ALBartus, HRJohnson, RK The inophyllums, novel inhibitors of HIV-1 reverse transcriptase isolated from the Malaysian tree, Calophyllum inophyllum Linn. J Med Chem36:4131-8 (1994) Reverse transcriptase/RNaseH
Name:Reverse transcriptase/RNaseH
Type:PROTEIN
Mol. Mass.:65229.15
Organism:Human immunodeficiency virus 1
Description:ChEMBL_1473730
Residue:566
BDBM50029993
NameBDBM50029993
Synonyms:3-(5-Hydroxy-2,3,8,8-tetramethyl-4-oxo-3,4-dihydro-2H,8H-pyrano[2,3-f]chromen-6-yl)-3-phenyl-acrylic acid | CHEMBL132827
TypeSmall organic molecule
Emp. Form.C25H24O6
Mol. Mass.420.4545
SMILESC[C@H]1Oc2c3C=CC(C)(C)Oc3c(C(=CC(O)=O)c3ccccc3)c(O)c2C(=O)[C@@H]1C