Reaction Details
TargetMultidrug transporter MdfA
LigandBDBM50046518
Substrate/Competitorn/a
Meas. Tech.ChEMBL_68323 (CHEMBL680694)
IC50 4700±n/a nM
Citation Nelson, MLPark, BHAndrews, JSGeorgian, VAThomas, RCLevy, SB Inhibition of the tetracycline efflux antiport protein by 13-thio-substituted 5-hydroxy-6-deoxytetracyclines. J Med Chem36:370-7 (1993) Multidrug transporter MdfA
Name:Multidrug transporter MdfA
Type:PROTEIN
Mol. Mass.:44327.48
Organism:Escherichia coli (strain K12)
Description:ChEMBL_68323
Residue:410
BDBM50046518
NameBDBM50046518
Synonyms:4-Dimethylamino-3,5,10,12,12a-pentahydroxy-6-(2-hydroxy-ethylsulfanylmethyl)-1,11-dioxo-1,4,4a,5,5a,6,11,12a-octahydro-naphthacene-2-carboxylic acid amide | CHEMBL125158
TypeSmall organic molecule
Emp. Form.C24H28N2O9S
Mol. Mass.520.552
SMILESCN(C)[C@H]1C2[C@@H](O)C3[C@@H](CSCCO)c4cccc(O)c4C(=O)C3C(=O)[C@]2(O)C(=O)C(C(N)=O)C1=O