Reaction Details
Target3-oxo-5-alpha-steroid 4-dehydrogenase 2
LigandBDBM50031890
Substrate/Competitorn/a
Meas. Tech.ChEMBL_213117 (CHEMBL818196)
IC50 8±n/a nM
Citation Jones, CDAudia, JELawhorn, DEMcQuaid, LANeubauer, BLPike, AJPennington, PAStamm, NBToomey, REHirsch, KS Nonsteroidal inhibitors of human type I steroid 5-alpha-reductase. J Med Chem36:421-3 (1993) 3-oxo-5-alpha-steroid 4-dehydrogenase 2
Name:3-oxo-5-alpha-steroid 4-dehydrogenase 2
Type:Enzyme
Mol. Mass.:28406.59
Organism:Homo sapiens (Human)
Description:P31213
Residue:254
BDBM50031890
NameBDBM50031890
Synonyms:(10R,13S)-17-tert-Butylcarbamoyl-10,13-dimethyl-2,7,8,9,10,11,12,13,14,15,16,17-dodecahydro-1H-cyclopenta[a]phenanthrene-3-carboxylic acid (10R,13S,17S)-17-tert-Butylcarbamoyl-10,13-dimethyl-2,7,8,9,10,11,12,13,14,15,16,17-dodecahydro-1H-cyclopenta[a]phenanthrene-3-carboxylic acid 17-tert-Butylcarbamoyl-10,13-dimethyl-2,7,8,9,10,11,12,13,14,15,16,17-dodecahydro-1H-cyclopenta[a]phenanthrene-3-carboxylic acid Epristeride
TypeSmall organic molecule
Emp. Form.C25H37NO3
Mol. Mass.399.5662
SMILES[H][C@@]12CC[C@H](C(=O)NC(C)(C)C)[C@@]1(C)CC[C@@]1([H])[C@@]2([H])CC=C2C=C(CC[C@]12C)C(O)=O