Reaction Details
Target3-oxo-5-alpha-steroid 4-dehydrogenase 1
LigandBDBM50044881
Substrate/Competitorn/a
Meas. Tech.ChEMBL_213114 (CHEMBL873905)
IC50 30±n/a nM
Citation Jones, CDAudia, JELawhorn, DEMcQuaid, LANeubauer, BLPike, AJPennington, PAStamm, NBToomey, REHirsch, KS Nonsteroidal inhibitors of human type I steroid 5-alpha-reductase. J Med Chem36:421-3 (1993) 3-oxo-5-alpha-steroid 4-dehydrogenase 1
Name:3-oxo-5-alpha-steroid 4-dehydrogenase 1
Type:Enzyme
Mol. Mass.:29472.80
Organism:Homo sapiens (Human)
Description:P18405
Residue:259
BDBM50044881
NameBDBM50044881
Synonyms:8-Chloro-4-methyl-1,4,5,6-tetrahydro-2H-benzo[f]quinolin-3-one | CHEMBL16456
TypeSmall organic molecule
Emp. Form.C14H14ClNO
Mol. Mass.247.72
SMILESCN1C(=O)CCC2=C1CCc1cc(Cl)ccc21