Reaction Details
TargetSigma non-opioid intracellular receptor 1
LigandBDBM50047725
Substrate/Competitorn/a
Meas. Tech.ChEMBL_226569 (CHEMBL848647)
Ki 3.6±n/a nM
Citation He, XSBowen, WDLee, KSWilliams, WWeinberger, DRde Costa, BR Synthesis and binding characteristics of potential SPECT imaging agents for sigma-1 and sigma-2 binding sites. J Med Chem36:566-71 (1993) Sigma non-opioid intracellular receptor 1
Name:Sigma non-opioid intracellular receptor 1
Type:Enzyme Catalytic Domain
Mol. Mass.:25124.85
Organism:Homo sapiens (Human)
Description:Q99720
Residue:223
BDBM50047725
NameBDBM50047725
Synonyms:(3-Iodo-benzyl)-methyl-(2-pyrrolidin-1-yl-ethyl)-amine | CHEMBL356909
TypeSmall organic molecule
Emp. Form.C14H21IN2
Mol. Mass.344.2344
SMILESCN(CCN1CCCC1)Cc1cccc(I)c1