Reaction Details
TargetReverse transcriptase/RNaseH
LigandBDBM50044907
Substrate/Competitorn/a
Meas. Tech.ChEMBL_197124 (CHEMBL801614)
EC50 80±n/a nM
Citation Sergheraert, CPierlot, CTartar, AHenin, YLemaitre, M Synthesis and anti-HIV evaluation of D4T and D4T 5'-monophosphate prodrugs. J Med Chem36:826-30 (1993) Reverse transcriptase/RNaseH
Name:Reverse transcriptase/RNaseH
Type:PROTEIN
Mol. Mass.:65229.15
Organism:Human immunodeficiency virus 1
Description:ChEMBL_1473730
Residue:566
BDBM50044907
NameBDBM50044907
Synonyms:CHEMBL166614 | Hexadecanoic acid 5-(5-methyl-2,4-dioxo-3,4-dihydro-2H-pyrimidin-1-yl)-2,5-dihydro-furan-2-ylmethyl ester
TypeSmall organic molecule
Emp. Form.C26H42N2O5
Mol. Mass.462.6221
(=O)OCC1OC(C=C1)n1cc(C)c(=O)[nH]c1=O