Reaction Details
TargetAdenosylhomocysteinase
LigandBDBM50051435
Substrate/Competitorn/a
Meas. Tech.ChEMBL_197370 (CHEMBL800623)
Ki 43±n/a nM
Citation Liu, SWnuk, SFYuan, CRobins, MJBorchardt, RT Adenosine-5'-carboxaldehyde: a potent inhibitor of S-adenosyl-L-homocysteine hydrolase. J Med Chem36:883-7 (1993) Adenosylhomocysteinase
Name:Adenosylhomocysteinase
Type:PROTEIN
Mol. Mass.:47537.52
Organism:Rattus norvegicus
Description:ChEMBL_1507790
Residue:432
BDBM50051435
NameBDBM50051435
Synonyms:5'-Dehydroadenosine 9-beta-D-ribo-pentodialdo-1,4-furanosyl-9H-purin-6-amine | CHEMBL308037
TypeSmall organic molecule
Emp. Form.C10H11N5O4
Mol. Mass.265.2254
SMILESNc1ncnc2n(cnc12)[C@@H]1O[C@H](C=O)[C@@H](O)[C@H]1O