Reaction Details
TargetPurine nucleoside phosphorylase
LigandBDBM50022243
Substrate/Competitorn/a
Meas. Tech.ChEMBL_153329 (CHEMBL760481)
Ki 800±n/a nM
Citation Chern, JWLee, HYChen, CSShewach, DSDaddona, PETownsend, LB Nucleosides. 5. Synthesis of guanine and formycin B derivatives as potential inhibitors of purine nucleoside phosphorylase. J Med Chem36:1024-31 (1993) Purine nucleoside phosphorylase
Name:Purine nucleoside phosphorylase
Type:Enzyme
Mol. Mass.:32119.53
Organism:Homo sapiens (Human)
Description:n/a
Residue:289
BDBM50022243
NameBDBM50022243
Synonyms:2,8-Diamino-1,9-dihydro-purin-6-one CHEMBL8040
TypeSmall organic molecule
Emp. Form.C5H6N6O
Mol. Mass.166.1407
SMILESNc1nc2nc(N)[nH]c(=O)c2[nH]1