Reaction Details
TargetD(2) dopamine receptor
LigandBDBM50034352
Substrate/Competitorn/a
Meas. Tech.ChEMBL_61294 (CHEMBL672486)
Ki 2.40±n/a nM
Citation Lin, CHHaadsma-Svensson, SRPhillips, GLahti, RAMcCall, RBPiercey, MFSchreur, PJVon Voigtlander, PFSmith, MWChidester, CG Centrally acting serotonergic and dopaminergic agents. 2. Synthesis and structure-activity relationships of 2,3,3a,4,9,9a-hexahydro-1H-benz[f]indole derivatives. J Med Chem36:1069-83 (1993) D(2) dopamine receptor
Name:D(2) dopamine receptor
Type:Cell-surface receptors
Mol. Mass.:50647.10
Organism:Homo sapiens (Human)
Description:P14416
Residue:443
BDBM50034352
NameBDBM50034352
Synonyms:(3aS,9aR) 1-Propyl-2,3,3a,4,9,9a-hexahydro-1H-benzo[f]indol-5-ol 1-Propyl-2,3,3a,4,9,9a-hexahydro-1H-benzo[f]indol-5-ol | CHEMBL11066
TypeSmall organic molecule
Emp. Form.C15H21NO
Mol. Mass.231.3333
SMILESCCCN1CC[C@@H]2Cc3c(O)cccc3C[C@@H]12