Reaction Details
TargetCathepsin B
LigandBDBM50046888
Substrate/Competitorn/a
Meas. Tech.ChEMBL_47253 (CHEMBL656659)
IC50 2000±n/a nM
Citation McConnell, RMYork, JLFrizzell, DEzell, C Inhibition studies of some serine and thiol proteinases by new leupeptin analogues. J Med Chem36:1084-9 (1993) Cathepsin B
Name:Cathepsin B
Type:Enzyme
Mol. Mass.:36657.87
Organism:Bos taurus (bovine)
Description:Bovine spleen CB was purchased from Sigma Co. (USA).
Residue:335
BDBM50046888
NameBDBM50046888
Synonyms:2-(2-Acetylamino-3-methyl-butyrylamino)-4-methyl-pentanoic acid (5-amino-1-formyl-pentyl)-amide | CHEMBL2373049
TypeSmall organic molecule
Emp. Form.C20H38N4O4
Mol. Mass.398.5401
SMILESCC[C@H](C)[C@H](NC(C)=O)C(=O)N[C@@H](CC(C)C)C(=O)N[C@@H](CCCCN)C=O