Reaction Details
TargetPlasma kallikrein
LigandBDBM50046893
Substrate/Competitorn/a
Meas. Tech.ChEMBL_92364 (CHEMBL701579)
IC50 78000±n/a nM
Citation McConnell, RMYork, JLFrizzell, DEzell, C Inhibition studies of some serine and thiol proteinases by new leupeptin analogues. J Med Chem36:1084-9 (1993) Plasma kallikrein
Name:Plasma kallikrein
Type:Protein
Mol. Mass.:71391.16
Organism:Homo sapiens (Human)
Description:P03952
Residue:638
BDBM50046893
NameBDBM50046893
Synonyms:2-[2-Acetylamino-3-(4-hydroxy-phenyl)-propionylamino]-4-methyl-pentanoic acid (1-formyl-4-guanidino-butyl)-amide | CHEMBL2373044
TypeSmall organic molecule
Emp. Form.C23H36N6O5
Mol. Mass.476.5691
SMILES[#6]-[#6](-[#6])-[#6]-[#6@H](-[#7]-[#6](=O)-[#6@H](-[#6]-c1ccc(-[#8])cc1)-[#7]-[#6](-[#6])=O)-[#6](=O)-[#7]-[#6@@H](-[#6]-[#6]-[#6]\[#7]=[#6](\[#7])-[#7])-[#6]=O