Reaction Details
TargetCathepsin B
LigandBDBM50046890
Substrate/Competitorn/a
Meas. Tech.ChEMBL_47253 (CHEMBL656659)
IC50 13000±n/a nM
Citation McConnell, RMYork, JLFrizzell, DEzell, C Inhibition studies of some serine and thiol proteinases by new leupeptin analogues. J Med Chem36:1084-9 (1993) Cathepsin B
Name:Cathepsin B
Type:Enzyme
Mol. Mass.:36657.87
Organism:Bos taurus (bovine)
Description:Bovine spleen CB was purchased from Sigma Co. (USA).
Residue:335
BDBM50046890
NameBDBM50046890
Synonyms:2-Acetylamino-4-methyl-pentanoic acid [1-(5-amino-1-formyl-pentylcarbamoyl)-2-methyl-propyl]-amide | CHEMBL2373045
TypeSmall organic molecule
Emp. Form.C19H36N4O4
Mol. Mass.384.5135
SMILESCC(C)C[C@H](NC(C)=O)C(=O)N[C@@H](C(C)C)C(=O)N[C@@H](CCCCN)C=O