Reaction Details
TargetProthrombin
LigandBDBM50046891
Substrate/Competitorn/a
Meas. Tech.ChEMBL_210580 (CHEMBL816531)
IC50 18000±n/a nM
Citation McConnell, RMYork, JLFrizzell, DEzell, C Inhibition studies of some serine and thiol proteinases by new leupeptin analogues. J Med Chem36:1084-9 (1993) Prothrombin
Name:Prothrombin
Type:Enzyme
Mol. Mass.:70502.73
Organism:Bos taurus (Bovine)
Description:P00735
Residue:625
BDBM50046891
NameBDBM50046891
Synonyms:2-(2-Acetylamino-4-methyl-pentanoylamino)-3-methyl-pentanoic acid (1-formyl-4-guanidino-butyl)-amide | CHEMBL2373046
TypeSmall organic molecule
Emp. Form.C20H38N6O4
Mol. Mass.426.5535
SMILES[#6]-[#6]-[#6@H](-[#6])-[#6@H](-[#7]-[#6](=O)-[#6@H](-[#6]-[#6](-[#6])-[#6])-[#7]-[#6](-[#6])=O)-[#6](=O)-[#7]-[#6@@H](-[#6]-[#6]-[#6]\[#7]=[#6](\[#7])-[#7])-[#6]=O