Reaction Details
TargetPlasminogen
LigandBDBM50286441
Substrate/Competitorn/a
Meas. Tech.ChEMBL_155050 (CHEMBL764369)
IC50 3700±n/a nM
Citation McConnell, RMYork, JLFrizzell, DEzell, C Inhibition studies of some serine and thiol proteinases by new leupeptin analogues. J Med Chem36:1084-9 (1993) Plasminogen
Name:Plasminogen
Type:PROTEIN
Mol. Mass.:91228.25
Organism:Bos taurus
Description:ChEMBL_222778
Residue:812
BDBM50286441
NameBDBM50286441
Synonyms:(S)-2-((S)-2-Acetylamino-4-(S)-methyl-pentanoylamino)-4-methyl-pentanoic acid (1-formyl-4-guanidino-butyl)-amide (S)-2-Acetylamino-4-methyl-pentanoic acid [(S)-1-((S)-1-formyl-4-guanidino-butylcarbamoyl)-3-methyl-butyl]-amide (S)-2-acetylamino-4-methyl-pentanoic acid [(S)-2-(1-formyl-4-guanidino-butylamino)-4-methyl-pentanoyl]-amide Ac-LLR-CHO CHEMBL129157
TypeSmall organic molecule
Emp. Form.C20H38N6O5
Mol. Mass.442.5529
SMILESCC(C)C[C@H](NC(C)=O)C(=O)N[C@@H](CC(C)C)C(=O)N[C@@H](CCCNC(N)=N)C(O)=O