Reaction Details
TargetCathepsin B
LigandBDBM50046900
Substrate/Competitorn/a
Meas. Tech.ChEMBL_47253 (CHEMBL656659)
IC50 18000±n/a nM
Citation McConnell, RMYork, JLFrizzell, DEzell, C Inhibition studies of some serine and thiol proteinases by new leupeptin analogues. J Med Chem36:1084-9 (1993) Cathepsin B
Name:Cathepsin B
Type:Enzyme
Mol. Mass.:36657.87
Organism:Bos taurus (bovine)
Description:Bovine spleen CB was purchased from Sigma Co. (USA).
Residue:335
BDBM50046900
NameBDBM50046900
Synonyms:2-(2-Acetylamino-3-phenyl-propionylamino)-4-methyl-pentanoic acid (5-amino-1-formyl-pentyl)-amide | CHEMBL2373052
TypeSmall organic molecule
Emp. Form.C23H36N4O4
Mol. Mass.432.5563
SMILESCC(C)C[C@H](NC(=O)[C@H](Cc1ccccc1)NC(C)=O)C(=O)N[C@@H](CCCCN)C=O