Reaction Details
TargetPolyunsaturated fatty acid 5-lipoxygenase
LigandBDBM50046906
Substrate/Competitorn/a
Meas. Tech.ChEMBL_4176 (CHEMBL619242)
IC50 700±n/a nM
Citation Mullican, MDWilson, MWConnor, DTKostlan, CRSchrier, DJDyer, RD Design of 5-(3,5-di-tert-butyl-4-hydroxyphenyl)-1,3,4-thiadiazoles, -1,3,4-oxadiazoles, and -1,2,4-triazoles as orally-active, nonulcerogenic antiinflammatory agents. J Med Chem36:1090-9 (1993) Polyunsaturated fatty acid 5-lipoxygenase
Name:Polyunsaturated fatty acid 5-lipoxygenase
Type:PROTEIN
Mol. Mass.:78082.31
Organism:Rattus norvegicus
Description:ChEMBL_1432947
Residue:673
BDBM50046906
NameBDBM50046906
Synonyms:4-(5-Amino-[1,3,4]oxadiazol-2-yl)-2,6-di-tert-butyl-phenol | CHEMBL12219
TypeSmall organic molecule
Emp. Form.C16H23N3O2
Mol. Mass.289.3727
SMILESCC(C)(C)c1cc(cc(c1O)C(C)(C)C)-c1nnc(N)o1