Reaction Details
TargetPolyunsaturated fatty acid 5-lipoxygenase
LigandBDBM50046912
Substrate/Competitorn/a
Meas. Tech.ChEMBL_4176 (CHEMBL619242)
IC50 210±n/a nM
Citation Mullican, MDWilson, MWConnor, DTKostlan, CRSchrier, DJDyer, RD Design of 5-(3,5-di-tert-butyl-4-hydroxyphenyl)-1,3,4-thiadiazoles, -1,3,4-oxadiazoles, and -1,2,4-triazoles as orally-active, nonulcerogenic antiinflammatory agents. J Med Chem36:1090-9 (1993) Polyunsaturated fatty acid 5-lipoxygenase
Name:Polyunsaturated fatty acid 5-lipoxygenase
Type:PROTEIN
Mol. Mass.:78082.31
Organism:Rattus norvegicus
Description:ChEMBL_1432947
Residue:673
BDBM50046912
NameBDBM50046912
Synonyms:5-[2-(3,5-Di-tert-butyl-4-hydroxy-phenyl)-vinyl]-3H-[1,3,4]oxadiazol-2-one | CHEMBL12395
TypeSmall organic molecule
Emp. Form.C18H24N2O3
Mol. Mass.316.3948
SMILESCC(C)(C)c1cc(C=Cc2n[nH]c(=O)o2)cc(c1O)C(C)(C)C