Reaction Details
TargetPolyunsaturated fatty acid 5-lipoxygenase
LigandBDBM50003127
Substrate/Competitorn/a
Meas. Tech.ChEMBL_4176 (CHEMBL619242)
IC50 2800±n/a nM
Citation Mullican, MDWilson, MWConnor, DTKostlan, CRSchrier, DJDyer, RD Design of 5-(3,5-di-tert-butyl-4-hydroxyphenyl)-1,3,4-thiadiazoles, -1,3,4-oxadiazoles, and -1,2,4-triazoles as orally-active, nonulcerogenic antiinflammatory agents. J Med Chem36:1090-9 (1993) Polyunsaturated fatty acid 5-lipoxygenase
Name:Polyunsaturated fatty acid 5-lipoxygenase
Type:PROTEIN
Mol. Mass.:78082.31
Organism:Rattus norvegicus
Description:ChEMBL_1432947
Residue:673
BDBM50003127
NameBDBM50003127
Synonyms:CHEMBL122193 CHEMBL16659 | choline salt of 5-(3,5-Di-tert-butyl-4-hydroxy-phenyl)-3H-[1,3,4]thiadiazole-2-thione
TypeSmall organic molecule
Emp. Form.C16H22N2OS2
Mol. Mass.322.489
SMILESCC(C)(C)c1cc(cc(c1O)C(C)(C)C)-c1nnc(S)s1