Reaction Details
TargetPolyunsaturated fatty acid 5-lipoxygenase
LigandBDBM50046917
Substrate/Competitorn/a
Meas. Tech.ChEMBL_4176 (CHEMBL619242)
IC50 2400±n/a nM
Citation Mullican, MDWilson, MWConnor, DTKostlan, CRSchrier, DJDyer, RD Design of 5-(3,5-di-tert-butyl-4-hydroxyphenyl)-1,3,4-thiadiazoles, -1,3,4-oxadiazoles, and -1,2,4-triazoles as orally-active, nonulcerogenic antiinflammatory agents. J Med Chem36:1090-9 (1993) Polyunsaturated fatty acid 5-lipoxygenase
Name:Polyunsaturated fatty acid 5-lipoxygenase
Type:PROTEIN
Mol. Mass.:78082.31
Organism:Rattus norvegicus
Description:ChEMBL_1432947
Residue:673
BDBM50046917
NameBDBM50046917
Synonyms:5-[2-(3,5-Di-tert-butyl-4-hydroxy-phenyl)-vinyl]-2,4-dihydro-[1,2,4]triazole-3-thione | CHEMBL275909
TypeSmall organic molecule
Emp. Form.C18H25N3OS
Mol. Mass.331.476
SMILESCC(C)(C)c1cc(C=Cc2n[nH]c(=S)[nH]2)cc(c1O)C(C)(C)C