Reaction Details
TargetPolyunsaturated fatty acid 5-lipoxygenase
LigandBDBM50008964
Substrate/Competitorn/a
Meas. Tech.ChEMBL_4176 (CHEMBL619242)
IC50 2400±n/a nM
Citation Mullican, MDWilson, MWConnor, DTKostlan, CRSchrier, DJDyer, RD Design of 5-(3,5-di-tert-butyl-4-hydroxyphenyl)-1,3,4-thiadiazoles, -1,3,4-oxadiazoles, and -1,2,4-triazoles as orally-active, nonulcerogenic antiinflammatory agents. J Med Chem36:1090-9 (1993) Polyunsaturated fatty acid 5-lipoxygenase
Name:Polyunsaturated fatty acid 5-lipoxygenase
Type:PROTEIN
Mol. Mass.:78082.31
Organism:Rattus norvegicus
Description:ChEMBL_1432947
Residue:673
BDBM50008964
NameBDBM50008964
Synonyms:2,6-Di-tert-butyl-4-[2-(3-methyl-isoxazol-5-yl)-vinyl]-phenol | CHEMBL12302
TypeSmall organic molecule
Emp. Form.C20H27NO2
Mol. Mass.313.4339
SMILESCc1cc(\C=C\c2cc(c(O)c(c2)C(C)(C)C)C(C)(C)C)on1