Reaction Details
TargetCytochrome P450 2D6
LigandBDBM50017681
Substrate/Competitorn/a
Meas. Tech.ChEMBL_147854 (CHEMBL758056)
Ki 43±n/a nM
Citation Strobl, GRvon Kruedener, SStöckigt, JGuengerich, FPWolff, T Development of a pharmacophore for inhibition of human liver cytochrome P-450 2D6: molecular modeling and inhibition studies. J Med Chem36:1136-45 (1993) Cytochrome P450 2D6
Name:Cytochrome P450 2D6
Type:Protein
Mol. Mass.:55774.82
Organism:Homo sapiens (Human)
Description:P10635
Residue:497
BDBM50017681
NameBDBM50017681
Synonyms:(1S,2R,4S,5R)-2-[(S)-Hydroxy-(6-methoxy-quinolin-4-yl)-methyl]-5-vinyl-1-azonia-bicyclo[2.2.2]octane (6-Methoxy-quinolin-4-yl)-(5-vinyl-1-aza-bicyclo[2.2.2]oct-2-yl)-methanol (6-Methoxy-quinolin-4-yl)-(5-vinyl-1-aza-bicyclo[2.2.2]oct-2-yl)-methanol; sulphate (S)-(6-Methoxy-quinolin-4-yl)-((2R,4S,5S)-5-vinyl-1-aza-bicyclo[2.2.2]oct-2-yl)-methanol (S)-(6-Methoxy-quinolin-4-yl)-(5-vinyl-1-aza-bicyclo[2.2.2]oct-2-yl)-methanol (S)-(6-methoxyquinolin-4-yl)((2R,4S,5R)-5-vinylquinuclidin-2-yl)methanol (S)-(6-methoxyquinolin-4-yl)((3S,4R,7R)-3-vinylquinuclidin-7-yl)methanol (quinidine)(6-Methoxy-quinolin-4-yl)-(5-vinyl-1-aza-bicyclo[2.2.2]oct-2-yl)-methanol 8R,9S(6-Methoxy-quinolin-4-yl)-(5-vinyl-1-aza-bicyclo[2.2.2]oct-2-yl)-methanol CIN-QUIN Duraquin Quinact Quinalan Quinidex Quinora | TCMDC-131239
TypeSmall organic molecule
Emp. Form.C20H24N2O2
Mol. Mass.324.4168
SMILESCOc1ccc2nccc([C@H](O)C3CC4CCN3CC4C=C)c2c1