Reaction Details
TargetCytochrome P450 2D6
LigandBDBM50047016
Substrate/Competitorn/a
Meas. Tech.ChEMBL_147856 (CHEMBL754768)
Ki 170±n/a nM
Citation Strobl, GRvon Kruedener, SStöckigt, JGuengerich, FPWolff, T Development of a pharmacophore for inhibition of human liver cytochrome P-450 2D6: molecular modeling and inhibition studies. J Med Chem36:1136-45 (1993) Cytochrome P450 2D6
Name:Cytochrome P450 2D6
Type:Protein
Mol. Mass.:55774.82
Organism:Homo sapiens (Human)
Description:P10635
Residue:497
BDBM50047016
NameBDBM50047016
Synonyms:1-(4-Fluoro-phenyl)-4-[4-hydroxy-4-(3-trifluoromethyl-phenyl)-piperidin-1-yl]-butan-1-one CHEMBL15023 | Trifluperidol
TypeSmall organic molecule
Emp. Form.C22H23F4NO2
Mol. Mass.409.4171
SMILESOC1(CCN(CCCC(=O)c2ccc(F)cc2)CC1)c1cccc(c1)C(F)(F)F