Reaction Details
TargetCytochrome P450 2D6
LigandBDBM50407152
Substrate/Competitorn/a
Meas. Tech.ChEMBL_123021 (CHEMBL729206)
Ki 31±n/a nM
Citation Strobl, GRvon Kruedener, SStöckigt, JGuengerich, FPWolff, T Development of a pharmacophore for inhibition of human liver cytochrome P-450 2D6: molecular modeling and inhibition studies. J Med Chem36:1136-45 (1993) Cytochrome P450 2D6
Name:Cytochrome P450 2D6
Type:Protein
Mol. Mass.:55774.82
Organism:Homo sapiens (Human)
Description:P10635
Residue:497
BDBM50407152
NameBDBM50407152
Synonyms:CHEMBL2079555
TypeSmall organic molecule
Emp. Form.C21H26N2O3
Mol. Mass.354.4427
SMILESCOC(=O)[C@H]1[C@H](O)CC[C@H]2CN3CCc4c([nH]c5ccccc45)[C@@H]3C[C@H]12