Reaction Details
TargetCytochrome P450 2D6
LigandBDBM50407157
Substrate/Competitorn/a
Meas. Tech.ChEMBL_123021 (CHEMBL729206)
Ki 66±n/a nM
Citation Strobl, GRvon Kruedener, SStöckigt, JGuengerich, FPWolff, T Development of a pharmacophore for inhibition of human liver cytochrome P-450 2D6: molecular modeling and inhibition studies. J Med Chem36:1136-45 (1993) Cytochrome P450 2D6
Name:Cytochrome P450 2D6
Type:Protein
Mol. Mass.:55774.82
Organism:Homo sapiens (Human)
Description:P10635
Residue:497
BDBM50407157
NameBDBM50407157
Synonyms:DIHYDROQUINIDINE | GNF-Pf-5606
TypeSmall organic molecule
Emp. Form.C20H26N2O2
Mol. Mass.326.4326
SMILESCCC1CN2CCC1CC2[C@@H](O)c1ccnc2ccc(OC)cc12