Reaction Details
TargetMu-type opioid receptor
LigandBDBM50043720
Substrate/Competitorn/a
Meas. Tech.ChEMBL_136096 (CHEMBL745618)
IC50 36±n/a nM
Citation Bartosz-Bechowski, HDavis, PZalewska, TSlaninova, JPorreca, FYamamura, HIHruby, VJ Cyclic enkephalin analogs with exceptional potency at peripheral delta opioid receptors. J Med Chem37:146-50 (1994) Mu-type opioid receptor
Name:Mu-type opioid receptor
Type:Enzyme Catalytic Domain
Mol. Mass.:11165.58
Organism:GUINEA PIG
Description:P97266
Residue:98
BDBM50043720
NameBDBM50043720
Synonyms:(S)-2-{[(4R,7S)-13-[(S)-2-Amino-3-(4-hydroxy-phenyl)-propionylamino]-7-(4-chloro-benzyl)-14,14-dimethyl-6,9,12-trioxo-1,2-dithia-5,8,11-triaza-cyclotetradecane-4-carbonyl]-amino}-3-phenyl-propionic acid | CHEMBL2372328
TypeSmall organic molecule
Emp. Form.C37H43ClN6O8S2
Mol. Mass.799.356
SMILESCC1(C)SSC[C@H](NC(=O)[C@H](Cc2ccc(Cl)cc2)NC(=O)CNC(=O)[C@@H]1NC(=O)[C@@H](N)Cc1ccc(O)cc1)C(=O)N[C@@H](Cc1ccccc1)C(O)=O