Reaction Details
TargetMu-type opioid receptor
LigandBDBM50453313
Substrate/Competitorn/a
Meas. Tech.ChEMBL_138881 (CHEMBL747873)
IC50 180±n/a nM
Citation Bartosz-Bechowski, HDavis, PZalewska, TSlaninova, JPorreca, FYamamura, HIHruby, VJ Cyclic enkephalin analogs with exceptional potency at peripheral delta opioid receptors. J Med Chem37:146-50 (1994) Mu-type opioid receptor
Name:Mu-type opioid receptor
Type:G Protein-Coupled Receptor (GPCR)
Mol. Mass.:44503.11
Organism:Rattus norvegicus (rat)
Description:Competition binding assays were carried out using membrane preparations from transfected HN9.10 cells that constitutively expressed the mu opioid receptor.
Residue:398
BDBM50453313
NameBDBM50453313
Synonyms:CHEMBL2372329
TypeSmall organic molecule
Emp. Form.C28H35N5O7S2
Mol. Mass.617.737
SMILESCC1(C)SSC[C@H](NC(=O)[C@H](Cc2ccccc2)NC(=O)CNC(=O)[C@@H]1NC(=O)[C@@H](N)Cc1ccc(O)cc1)C(O)=O