Reaction Details
TargetDelta-type opioid receptor
LigandBDBM50043724
Substrate/Competitorn/a
Meas. Tech.ChEMBL_145895 (CHEMBL754260)
IC50 82.7±n/a nM
Citation Bartosz-Bechowski, HDavis, PZalewska, TSlaninova, JPorreca, FYamamura, HIHruby, VJ Cyclic enkephalin analogs with exceptional potency at peripheral delta opioid receptors. J Med Chem37:146-50 (1994) Delta-type opioid receptor
Name:Delta-type opioid receptor
Type:Enzyme Catalytic Domain
Mol. Mass.:40577.25
Organism:MOUSE
Description:P32300
Residue:372
BDBM50043724
NameBDBM50043724
Synonyms:(S)-2-({(4R,7S)-13-[(S)-2-Amino-3-(4-hydroxy-phenyl)-propionylamino]-7-benzyl-14,14-dimethyl-6,9,12-trioxo-1,2-dithia-5,8,11-triaza-cyclotetradecane-4-carbonyl}-amino)-3-phenyl-propionic acid | CHEMBL339320
TypeSmall organic molecule
Emp. Form.C37H44N6O8S2
Mol. Mass.764.911
SMILESCC1(C)SSC[C@H](NC(=O)[C@H](Cc2ccccc2)NC(=O)CNC(=O)[C@@H]1NC(=O)[C@@H](N)Cc1ccc(O)cc1)C(=O)N[C@@H](Cc1ccccc1)C(O)=O