Reaction Details
Target5-hydroxytryptamine receptor 1A
LigandBDBM50041469
Substrate/Competitorn/a
Meas. Tech.ChEMBL_1427 (CHEMBL872107)
Ki 0.38±n/a nM
Citation Zhuang, ZPKung, MPKung, HF Synthesis and evaluation of 4-(2'-methoxyphenyl)-1-[2'-[N-(2"-pyridinyl)-p- iodobenzamido]ethyl]piperazine (p-MPPI): a new iodinated 5-HT1A ligand. J Med Chem37:1406-7 (1994) 5-hydroxytryptamine receptor 1A
Name:5-hydroxytryptamine receptor 1A
Type:G Protein-Coupled Receptor (GPCR)
Mol. Mass.:46445.29
Organism:Rattus norvegicus (rat)
Description:Binding assays were performed using rat hippocampal membranes.
Residue:422
BDBM50041469
NameBDBM50041469
Synonyms:(R,S) 7-[(3-Iodo-allyl)-propyl-amino]-5,6,7,8-tetrahydro-naphthalen-1-ol CHEMBL284716
TypeSmall organic molecule
Emp. Form.C16H22INO
Mol. Mass.371.2565
SMILESCCCN(C\C=C\I)C1CCc2cccc(O)c2C1