Reaction Details
Target5-hydroxytryptamine receptor 1A
LigandBDBM50041471
Substrate/Competitorn/a
Meas. Tech.ChEMBL_1427 (CHEMBL872107)
Ki 1.6±n/a nM
Citation Zhuang, ZPKung, MPKung, HF Synthesis and evaluation of 4-(2'-methoxyphenyl)-1-[2'-[N-(2"-pyridinyl)-p- iodobenzamido]ethyl]piperazine (p-MPPI): a new iodinated 5-HT1A ligand. J Med Chem37:1406-7 (1994) 5-hydroxytryptamine receptor 1A
Name:5-hydroxytryptamine receptor 1A
Type:G Protein-Coupled Receptor (GPCR)
Mol. Mass.:46445.29
Organism:Rattus norvegicus (rat)
Description:Binding assays were performed using rat hippocampal membranes.
Residue:422
BDBM50041471
NameBDBM50041471
Synonyms:CHEMBL30758 | N-{2-[4-(2-Methoxy-phenyl)-piperazin-1-yl]-ethyl}-4-nitro-N-pyridin-2-yl-benzamide
TypeSmall organic molecule
Emp. Form.C25H27N5O4
Mol. Mass.461.513
SMILESCOc1ccccc1N1CCN(CCN(C(=O)c2ccc(cc2)[N+]([O-])=O)c2ccccn2)CC1