Reaction Details
TargetSodium-dependent dopamine transporter
LigandBDBM22165
Substrate/Competitorn/a
Meas. Tech.ChEMBL_62641 (CHEMBL676686)
Ki 0.880000±n/a nM
Citation Goodman, MMKung, MPKabalka, GWKung, HFSwitzer, R Synthesis and characterization of radioiodinated N-(3-iodopropen-1-yl)-2 beta-carbomethoxy-3 beta-(4-chlorophenyl)tropanes: potential dopamine reuptake site imaging agents. J Med Chem37:1535-42 (1994) Sodium-dependent dopamine transporter
Name:Sodium-dependent dopamine transporter
Type:Multi-pass membrane protein
Mol. Mass.:68749.45
Organism:Rattus norvegicus (rat)
Description:P23977
Residue:619
BDBM22165
NameBDBM22165
Synonyms:1-{2-[bis(4-fluorophenyl)methoxy]ethyl}-4-(3-phenylpropyl)piperazine CHEMBL281594 CHEMBL543876 GBR-12909 US9944618, Compound ID No. 175 | Vanoxerine
TypeSmall organic molecule
Emp. Form.C28H32F2N2O
Mol. Mass.450.5633
SMILESFc1ccc(cc1)C(OCCN1CCN(CCCc2ccccc2)CC1)c1ccc(F)cc1