Reaction Details
TargetDelta-type opioid receptor
LigandBDBM50453339
Substrate/Competitorn/a
Meas. Tech.ChEMBL_145893 (CHEMBL754259)
IC50 85±n/a nM
Citation Haaseth, RCHoran, PJBilsky, EJDavis, PZalewska, TSlaninova, JYamamura, HIWeber, SJDavis, TPPorreca, F [L-Ala3]DPDPE: a new enkephalin analog with a unique opioid receptor activity profile. Further evidence of delta-opioid receptor multiplicity. J Med Chem37:1572-7 (1994) Delta-type opioid receptor
Name:Delta-type opioid receptor
Type:Enzyme Catalytic Domain
Mol. Mass.:40577.25
Organism:MOUSE
Description:P32300
Residue:372
BDBM50453339
NameBDBM50453339
Synonyms:CHEMBL2372412
TypeSmall organic molecule
Emp. Form.C32H45N5O7S2
Mol. Mass.675.859
SMILESCC[C@@H]1NC(=O)[C@@H](NC(=O)[C@@H](N)Cc2ccc(O)cc2)C(C)(C)SSC(C)(C)[C@H](NC(=O)[C@H](Cc2ccccc2)NC1=O)C(O)O