Reaction Details
TargetDelta-type opioid receptor
LigandBDBM50041669
Substrate/Competitorn/a
Meas. Tech.ChEMBL_146764 (CHEMBL755208)
IC50 18±n/a nM
Citation Haaseth, RCHoran, PJBilsky, EJDavis, PZalewska, TSlaninova, JYamamura, HIWeber, SJDavis, TPPorreca, F [L-Ala3]DPDPE: a new enkephalin analog with a unique opioid receptor activity profile. Further evidence of delta-opioid receptor multiplicity. J Med Chem37:1572-7 (1994) Delta-type opioid receptor
Name:Delta-type opioid receptor
Type:G Protein-Coupled Receptor (GPCR)
Mol. Mass.:40465.04
Organism:Rattus norvegicus (rat)
Description:Competition binding assays were using CHO-K1 cell membranes expressing the opioid receptor.
Residue:372
BDBM50041669
NameBDBM50041669
Synonyms:2-Amino-N-(7-benzyl-4-dihydroxymethyl-3,3,10,14,14-pentamethyl-6,9,12-trioxo-1,2-dithia-5,8,11-triaza-cyclotetradec-13-yl)-3-(4-hydroxy-phenyl)-propionamide | CHEMBL43637
TypeSmall organic molecule
Emp. Form.C31H43N5O7S2
Mol. Mass.661.832
SMILESCC1NC(=O)C(NC(=O)C(N)Cc2ccc(O)cc2)C(C)(C)SSC(C)(C)C(NC(=O)C(Cc2ccccc2)NC1=O)C(O)O