Reaction Details
TargetDelta-type opioid receptor
LigandBDBM50030143
Substrate/Competitorn/a
Meas. Tech.ChEMBL_146724 (CHEMBL753262)
IC50 11±n/a nM
Citation Archer, SSeyed-Mozaffari, AJiang, QBidlack, JM 14 alpha,14' beta-[Dithiobis[(2-oxo-2,1-ethanediyl)imino]]bis (7,8-dihydromorphinone) and 14 alpha,14' beta-[dithiobis[(2-oxo-2,1- ethanediyl)imino]]bis[7,8-dihydro-N-(cyclopropylmethyl)normorphinone]: chemistry and opioid binding properties. J Med Chem37:1578-85 (1994) Delta-type opioid receptor
Name:Delta-type opioid receptor
Type:G Protein-Coupled Receptor (GPCR)
Mol. Mass.:40382.98
Organism:Homo sapiens (Human)
Description:Competition binding assays were carried out using membrane preparations from transfected HN9.10 cells that constitutively expressed the delta opioid receptor.
Residue:372
BDBM50030143
NameBDBM50030143
Synonyms:CHEMBL41098 | bis-(1N-[10-hydroxy-4-methyl-14-oxo-12-oxa-4-azapentacyclo[9.6.1.01,13.05,17.07,18]octadeca-7,9,11(18)-trien-17-yl]-2-sulfanylacetamide )
TypeSmall organic molecule
Emp. Form.C38H42N4O8S2
Mol. Mass.746.892
SMILESCN1CC[C@@]23[C@H]4Oc5c2c(C[C@@H]1[C@@]3(CCC4=O)NC(=O)CSSCC(=O)N[C@]12CCC(=O)[C@@H]3Oc4c6c(C[C@H]1N(C)CC[C@@]236)ccc4O)ccc5O