Reaction Details
TargetMu-type opioid receptor
LigandBDBM50030143
Substrate/Competitorn/a
Meas. Tech.ChEMBL_136072 (CHEMBL744991)
IC50 0.40±n/a nM
Citation Archer, SSeyed-Mozaffari, AJiang, QBidlack, JM 14 alpha,14' beta-[Dithiobis[(2-oxo-2,1-ethanediyl)imino]]bis (7,8-dihydromorphinone) and 14 alpha,14' beta-[dithiobis[(2-oxo-2,1- ethanediyl)imino]]bis[7,8-dihydro-N-(cyclopropylmethyl)normorphinone]: chemistry and opioid binding properties. J Med Chem37:1578-85 (1994) Mu-type opioid receptor
Name:Mu-type opioid receptor
Type:Enzyme Catalytic Domain
Mol. Mass.:45038.37
Organism:CALF
Description:OPIATE Mu 2 0 CALF::P79350
Residue:401
BDBM50030143
NameBDBM50030143
Synonyms:CHEMBL41098 | bis-(1N-[10-hydroxy-4-methyl-14-oxo-12-oxa-4-azapentacyclo[9.6.1.01,13.05,17.07,18]octadeca-7,9,11(18)-trien-17-yl]-2-sulfanylacetamide )
TypeSmall organic molecule
Emp. Form.C38H42N4O8S2
Mol. Mass.746.892
SMILESCN1CC[C@@]23[C@H]4Oc5c2c(C[C@@H]1[C@@]3(CCC4=O)NC(=O)CSSCC(=O)N[C@]12CCC(=O)[C@@H]3Oc4c6c(C[C@H]1N(C)CC[C@@]236)ccc4O)ccc5O