Reaction Details
TargetDihydrofolate reductase
LigandBDBM50016460
Substrate/Competitorn/a
Meas. Tech.ChEMBL_54442 (CHEMBL669645)
IC50 11±n/a nM
Citation Kotake, YIijima, AYoshimatsu, KTamai, NOzawa, YKoyanagi, NKitoh, KNomura, H Synthesis and antitumor activities of novel 6-5 fused ring heterocycle antifolates: N-[4-[omega-(2-amino-4-substituted-6,7-dihydrocyclopenta [d]pyrimidin-5-yl)alkyl]benzoyl]-L-glutamic acids. J Med Chem37:1616-24 (1994) Dihydrofolate reductase
Name:Dihydrofolate reductase
Type:Enzyme
Mol. Mass.:21608.82
Organism:Mus musculus (Mouse)
Description:n/a
Residue:187
BDBM50016460
NameBDBM50016460
Synonyms:(S)-2-{4-[1-(2,4-Diamino-pteridin-6-ylmethyl)-propyl]-benzoylamino}-pentanedioic acid Edatrexate TCMDC-137768
TypeSmall organic molecule
Emp. Form.C22H25N7O5
Mol. Mass.467.4778
SMILESCCC(Cc1cnc2nc(N)nc(N)c2n1)c1ccc(cc1)C(=O)N[C@@H](CCC(O)=O)C(O)=O