Reaction Details
TargetAdenosine receptor A1
LigandBDBM50453347
Substrate/Competitorn/a
Meas. Tech.ChEMBL_28850 (CHEMBL644127)
Ki 2.5±n/a nM
Citation Cristalli, GVolpini, RVittori, SCamaioni, EMonopoli, AConti, ADionisotti, SZocchi, COngini, E 2-Alkynyl derivatives of adenosine-5'-N-ethyluronamide: selective A2 adenosine receptor agonists with potent inhibitory activity on platelet aggregation. J Med Chem37:1720-6 (1994) Adenosine receptor A1
Name:Adenosine receptor A1
Type:Protein
Mol. Mass.:36704.13
Organism:Rattus norvegicus (rat)
Description:n/a
Residue:326
BDBM50453347
NameBDBM50453347
Synonyms:CHEMBL2094083
TypeSmall organic molecule
Emp. Form.C21H22N6O5
Mol. Mass.438.4366
SMILESCCNC(=O)[C@H]1O[C@H]([C@H](O)[C@@H]1O)n1cnc2c(N)nc(nc12)C#CC(O)c1ccccc1