Reaction Details
TargetDelta-type opioid receptor
LigandBDBM50038424
Substrate/Competitorn/a
Meas. Tech.ChEMBL_145747 (CHEMBL752636)
EC50 0.360000±n/a nM
Citation Qian, XKövér, KEShenderovich, MDLou, BSMisicka, AZalewska, THorváth, RDavis, PBilsky, EJPorreca, F Newly discovered stereochemical requirements in the side-chain conformation of delta opioid agonists for recognizing opioid delta receptors. J Med Chem37:1746-57 (1994) Delta-type opioid receptor
Name:Delta-type opioid receptor
Type:Enzyme Catalytic Domain
Mol. Mass.:40577.25
Organism:MOUSE
Description:P32300
Residue:372
BDBM50038424
NameBDBM50038424
Synonyms:(S)-3-[(S)-2-((R)-2-Amino-propionylamino)-3-phenyl-propionylamino]-N-{(S)-1-[(S)-1-(carbamoylmethyl-carbamoyl)-2-methyl-propylcarbamoyl]-2-methyl-propyl}-succinamic acid | CHEMBL49581
TypeSmall organic molecule
Emp. Form.C28H43N7O8
Mol. Mass.605.6831
SMILESCC(C)[C@H](NC(=O)[C@@H](NC(=O)[C@H](CC(O)=O)NC(=O)[C@H](Cc1ccccc1)NC(=O)[C@@H](C)N)C(C)C)C(=O)NCC(N)=O